isobutyl 3-hydroxybutanoate

Van Den Dool and Kratz RI, non-polar column, temperature ramp

View large format table.

Column type Active phase I Reference Comment
CapillaryDB-11091.Adedeji, Hartman, et al., 199160. m/0.25 mm/0.25 μm, He, 40. C @ 3. min, 2. K/min, 280. C @ 10. min
CapillaryDB-11093.Adedeji, Hartman, et al., 199160. m/0.25 mm/0.25 μm, He, 40. C @ 3. min, 2. K/min, 280. C @ 10. min

Normal alkane RI, polar column, temperature ramp

View large format table.

Column type Active phase I Reference Comment
CapillaryDB-Wax1633.Werkhoff, Güntert, et al., 199860. m/0.32 mm/0.25 μm, H2, 3. K/min; Tstart: 60. C; Tend: 220. C
CapillaryCarbowax 20M1617.Engel and Tressl, 19832. K/min; Column length: 50. m; Column diameter: 0.25 mm; Tstart: 70. C; Tend: 180. C

References

Adedeji, Hartman, et al., 1991
Adedeji, J.; Hartman, T.G.; Rosen, R.T.; Ho, C.-T., Free and glycosidically bound aroma compounds in hog plum (Spondias mombins L.), J. Agric. Food Chem., 1991, 39, 8, 1494-1497, https://doi.org/10.1021/jf00008a025 . [all data]

Werkhoff, Güntert, et al., 1998
Werkhoff, P.; Güntert, M.; Krammer, G.; Sommer, H.; Kaulen, J., Vacuum headspace method in aroma research: flavor chemistry of yellow passion fruits, J. Agric. Food Chem., 1998, 46, 3, 1076-1093, https://doi.org/10.1021/jf970655s . [all data]

Engel and Tressl, 1983
Engel, K.-H.; Tressl, R., Studies on the volatile components of two mango varieties, J. Agric. Food Chem., 1983, 31, 4, 796-801, https://doi.org/10.1021/jf00118a029 . [all data]