Angeloyloxymultiflorine

Normal alkane RI, non-polar column, temperature ramp

View large format table.

Column type Active phase I Reference Comment
CapillaryDB-12925.Wink and Witte, 199130. m/0.32 mm/1.0 μm, Helium, 150. C @ 1. min, 10. K/min; Tend: 300. C

References

Wink and Witte, 1991
Wink, M.; Witte, L., Storage of quinolizidine alkaloids in Macrosiphum albifrons and Aphis genistae (Homoptera: Aphididae), Entomol. Gener., 1991, 15, 4, 237-254, https://doi.org/10.1127/entom.gen/15/1991/237 . [all data]