S-Methyl thio-4-methylpentanoate

Normal alkane RI, polar column, custom temperature program

View large format table.

Column type Active phase I Reference Comment
CapillaryEC-10001355.Delabre and Bendall, 9999Program: not specified

References

Delabre and Bendall, 9999
Delabre, M.-L.; Bendall, J.F., Flavour ingredients from fermented dairy streams, Expression of Multidisciplinary Flavour Sci., 9999, 375-378. [all data]