Davana ether, isomer # 2

Normal alkane RI, non-polar column, temperature ramp

Data compiled by: NIST Mass Spectrometry Data Center, William E. Wallace, director

Column type Capillary
Active phase HP-5MS
Column length (m) 30.
Carrier gas Helium
Substrate
Column diameter (mm) 0.25
Phase thickness (μm) 0.25
Tstart (C) 50.
Tend (C) 250.
Heat rate (K/min) 7.
Initial hold (min) 1.
Final hold (min) 5.
I 1517.
ReferenceZouari, Zouari, et al., 2010
Comment MSDC-RI

References

Zouari, Zouari, et al., 2010
Zouari, S.; Zouari, N.; Fakhfakh, N.; Bougatel, A.; Ayadi, M.A.; Neffati, M., Chemical composition and biological activities of a new essential oil chemotype of Tunisian Artemisia herba alba Asso, J. Medicinal Plants Res., 2010, 4, 10, 871-880. [all data]