trans-Ocimene oxide

Normal alkane RI, non-polar column, custom temperature program

View large format table.

Column type Active phase I Reference Comment
CapillaryCP-Sil 8 CB1141.Di Giusto, Bessiere, et al., 201030. m/0.25 mm/0.25 μm, Helium; Program: Multi-rise program

References

Di Giusto, Bessiere, et al., 2010
Di Giusto, B.; Bessiere, J.-M.; Gueroult, M.; Lim, L.B.L.; Marshall, D.J.; Hossaert-McKey, M.; Gaume, L., Flower-scent mimicry masks a deadly trap in the carnivorous plant Nepenthes raffesiana, J. Ecology, 2010, 98, 4, 845-856, https://doi.org/10.1111/j.1365-2745.2010.01665.x . [all data]