Phenol, 4-(1,1,4,4-tetramethylpentyl)

Normal alkane RI, non-polar column, custom temperature program

Data compiled by: NIST Mass Spectrometry Data Center, William E. Wallace, director

Column type CapillaryCapillary
Active phase HP-5 MSHP-5 MS
Column length (m) 30.30.
Carrier gas HeliumHelium
Substrate
Column diameter (mm) 0.250.25
Phase thickness (μm) 0.250.25
Program not specifiednot specified
I 1646.1647.
ReferenceZenkevich, Makarov A.A., et al., 2009Zenkevich, Makarov A.A., et al., 2009
Comment MSDC-RI MSDC-RI

References

Zenkevich, Makarov A.A., et al., 2009
Zenkevich, I.G.; Makarov A.A.; Schrader, S.; Moeder, M., A new version of an additive scheme for the prediction of gas chromatographic retention indices of the 211 structural isomers of 4-nonylphenol, J. Chromatogr. A, 2009, 1216, 18, 4097-4106, https://doi.org/10.1016/j.chroma.2009.03.021 . [all data]