Phenol, 4-(1,1,2-trimethylhexyl)

Normal alkane RI, non-polar column, temperature ramp

View large format table.

Column type Active phase I Reference Comment
CapillaryHP-5 MS1745.Zenkevich, Makarov A.A., et al., 200930. m/0.25 mm/0.25 μm, Helium, 2. K/min, 220. C @ 10. min; Tstart: 50. C

Normal alkane RI, non-polar column, custom temperature program

View large format table.

Column type Active phase I Reference Comment
CapillaryHP-5 MS1743.Zenkevich, Makarov A.A., et al., 200930. m/0.25 mm/0.25 μm, Helium; Program: not specified
CapillaryHP-5 MS1743.Zenkevich, Makarov A.A., et al., 200930. m/0.25 mm/0.25 μm, Helium; Program: not specified

References

Zenkevich, Makarov A.A., et al., 2009
Zenkevich, I.G.; Makarov A.A.; Schrader, S.; Moeder, M., A new version of an additive scheme for the prediction of gas chromatographic retention indices of the 211 structural isomers of 4-nonylphenol, J. Chromatogr. A, 2009, 1216, 18, 4097-4106, https://doi.org/10.1016/j.chroma.2009.03.021 . [all data]