Bicyclo[2.2.1]heptan-2-ol, 1,7,7-trimethyl, acetate

Normal alkane RI, non-polar column, temperature ramp

Data compiled by: NIST Mass Spectrometry Data Center, William E. Wallace, director

Column type Capillary
Active phase DB-5
Column length (m) 50.
Carrier gas Nitrogen
Substrate
Column diameter (mm) 0.20
Phase thickness (μm) 0.32
Tstart (C) 60.
Tend (C) 220.
Heat rate (K/min) 5.
Initial hold (min) 3.
Final hold (min) 5.
I 1595.
ReferenceShafaghat and Sadeghi, 2009
Comment MSDC-RI

References

Shafaghat and Sadeghi, 2009
Shafaghat, A.; Sadeghi, H., Composition and antibacterial activity of essentia; oils from leaf, stem and root of Chrysanthemum parthenium (L.) Bernh. from Iran, Electronic J. of Environ., Agriculture and Food Chem. (EJEAFChe), 2009, 8, 9, 766-771. [all data]