2-Methyl-2,4,6-octatriene
- Formula: C9H14
- Molecular weight: 122.2075
- IUPAC Standard InChIKey: AHXXJOUHGBPWGW-YTXTXJHMSA-N
- Chemical structure:

Normal alkane RI, non-polar column, temperature ramp

Column type | Active phase | I | Reference | Comment |
---|---|---|---|---|
Capillary | DB-5 | 985. | Shafaghat and Sadeghi, 2009 | 50. m/0.20 mm/0.32 μm, Nitrogen, 60. C @ 3. min, 5. K/min, 220. C @ 5. min |

References

Shafaghat and Sadeghi, 2009
Shafaghat, A.; Sadeghi, H.,
Composition and antibacterial activity of essentia; oils from leaf, stem and root of Chrysanthemum parthenium (L.) Bernh. from Iran,
Electronic J. of Environ., Agriculture and Food Chem. (EJEAFChe), 2009, 8, 9, 766-771. [all data]