Isolyratol

Normal alkane RI, non-polar column, temperature ramp

Data compiled by: NIST Mass Spectrometry Data Center, William E. Wallace, director

Column type CapillaryCapillary
Active phase RTX-1RTX-1
Column length (m) 60.60.
Carrier gas HeliumHelium
Substrate
Column diameter (mm) 0.220.22
Phase thickness (μm) 0.250.25
Tstart (C) 60.60.
Tend (C) 230.230.
Heat rate (K/min) 2.2.
Initial hold (min)
Final hold (min) 30.30.
I 1052.1053.
ReferenceMuseli, Pau, et al., 2009Museli, Pau, et al., 2009
Comment MSDC-RI MSDC-RI

References

Museli, Pau, et al., 2009
Museli, A.; Pau, M.; Desjobert, J.-M.; Foddai, M.; Usai, M.; Costa, J., Volatile constituents of Achllea ligustica All. by HS-SPME/GC/GC-MS. Comparison with essential oils obtained by hydrodistillation from Corsica and Sardinia, Chromatographia, 2009, 69, 5/6, 575-585, https://doi.org/10.1365/s10337-008-0939-1 . [all data]