Grahamine

Normal alkane RI, non-polar column, temperature ramp

View large format table.

Column type Active phase I Reference Comment
CapillaryDB-5 MS2711.Fletcher, McKenzie, et al., 2009Helium, 50. C @ 5. min, 20. K/min; Column length: 30. m; Column diameter: 0.25 mm; Tend: 300. C

References

Fletcher, McKenzie, et al., 2009
Fletcher, M.T.; McKenzie, R.A.; Blaney, B.J.; Reichmann, K.G., Pyrrolizidine alkaloids in Crotalaria taxa from Northern Australia: risk to grazing livestock, J. Agric. Food Chem., 2009, 57, 1, 311-319, https://doi.org/10.1021/jf8026099 . [all data]