Chlorocarbene aftifact of 7β-Hydroxy-1-methylene-8α/β-pyrrolizidine

Normal alkane RI, non-polar column, temperature ramp

Data compiled by: NIST Mass Spectrometry Data Center, William E. Wallace, director

Column type Capillary
Active phase DB-5 MS
Column length (m) 30.
Carrier gas Helium
Substrate
Column diameter (mm) 0.25
Phase thickness (μm)
Tstart (C) 50.
Tend (C) 300.
Heat rate (K/min) 20.
Initial hold (min) 5.
Final hold (min)
I 1426.
ReferenceFletcher, McKenzie, et al., 2009
Comment MSDC-RI

References

Fletcher, McKenzie, et al., 2009
Fletcher, M.T.; McKenzie, R.A.; Blaney, B.J.; Reichmann, K.G., Pyrrolizidine alkaloids in Crotalaria taxa from Northern Australia: risk to grazing livestock, J. Agric. Food Chem., 2009, 57, 1, 311-319, https://doi.org/10.1021/jf8026099 . [all data]