2-Glucosyl-cellobiose: aD-Glcp(1->2)-bDGlcp(1->4)-DGlc, oxime-TMS, isomer # 2

Normal alkane RI, non-polar column, custom temperature program

Data compiled by: NIST Mass Spectrometry Data Center, William E. Wallace, director

Column type Capillary
Active phase HT-5
Column length (m)
Carrier gas Helium
Substrate
Column diameter (mm)
Phase thickness (μm)
Program 200 0C (15 min) 1 0C/min -> 290 0C 50 0C/min -> 350 0C (30 min)
I 3449.
ReferenceBrokl, Soria, et al., 2009
Comment MSDC-RI

References

Brokl, Soria, et al., 2009
Brokl, M.; Soria, A.C.; Martinez-Castro, I.; Sanz, M.L.; Ruiz-Mature, A.I., Characterization of O-trimethylsilyl oximes of trisaccharides by gas chromatography - mass spectrometry, J. Chromatogr. A, 2009, 1216, 22, 4689-4692, https://doi.org/10.1016/j.chroma.2009.03.069 . [all data]