D-Pro, N-ethoxycarbonyl, (S)-1-phenylethylamide

Normal alkane RI, non-polar column, custom temperature program

View large format table.

Column type Active phase I Reference Comment
CapillaryDB-52156.Paik, Lee, et al., 200830. m/0.25 mm/0.25 μm, Helium; Program: 80 0C (2 min) 20 0C/min -> 150 0C 3 0C/min -> 230 0C 10 0C/min -> 290 0C (20 min)

References

Paik, Lee, et al., 2008
Paik, M.-J.; Lee, J.; Kim, K.-R., N-Ethoxycarbonylation combined with (S)-1-phenylethylamidation for enantioseparation of amino acids by achiral gas chromatography and gas chromatography - mass spectrometry, J. Chromatogr. A, 2008, 1214, 1-2, 151-156, https://doi.org/10.1016/j.chroma.2008.10.068 . [all data]