(3aRS,4RS,7aSR)-(Octahydro-1H-inden-4-yl) methanol

Normal alkane RI, non-polar column, temperature ramp

View large format table.

Column type Active phase I Reference Comment
CapillarySPB-11275.Starkenmann, Mayenzet, et al., 200730. m/0.25 mm/0.25 μm, Helium, 50. C @ 5. min, 5. K/min, 240. C @ 999. min

Normal alkane RI, polar column, temperature ramp

View large format table.

Column type Active phase I Reference Comment
CapillarySupelcowax 101920.Starkenmann, Mayenzet, et al., 200730. m/0.25 mm/0.25 μm, Helium, 50. C @ 5. min, 5. K/min, 240. C @ 999. min

References

Starkenmann, Mayenzet, et al., 2007
Starkenmann, C.; Mayenzet, F.; Brauchli, R.; Wunsche, L.; Vial, C., Structure elucidation of a pungent compound in black cardamon: Amomum tsao-ko Crevost et Lemarie (Zingiberaceae), J. Agric. Food Chem., 2007, 55, 26, 10902-10907, https://doi.org/10.1021/jf072707b . [all data]