19-Hydroxy-ent-kaur-16-ene

Normal alkane RI, non-polar column, temperature ramp

View large format table.

Column type Active phase I Reference Comment
CapillaryAT-52348.Meccia, Rojas, et al., 200760. m/0.25 mm/0.25 μm, Helium, 4. K/min; Tstart: 60. C; Tend: 260. C

References

Meccia, Rojas, et al., 2007
Meccia, G.; Rojas, L.B.; Velasco, J.; Diaz, T.; Usubillaga, A., Composition and antibacterial screening of the essential oils of leaves and roots of Espeletiopsis angustifolia Cuetrec, Natural Product Communications, 2007, 2, 12, 1221-1224. [all data]