5-[(4E)-3,6-dimethyl-6-(3,4,7,8-tetramethylnonyl)-4,7-octadienyl]-1,3,4,4,6-pentamethyl-1-cyclohexene

Normal alkane RI, non-polar column, custom temperature program

View large format table.

Column type Active phase I Reference Comment
CapillaryDB-1 MS2796.Gao, Simoneit, et al., 200730. m/0.25 mm/0.25 μm; Program: 60 0C 6 0C/min -> 180 0C 3 0C/min -> 300 0C (20 min)

References

Gao, Simoneit, et al., 2007
Gao, M.; Simoneit, B.R.T.; Gantar, M.; Jaffe, R., Occurrence and distribution of novel botryococcene hydrocarbons in freshwater wetland of the Florida Everglades, Chemosphere, 2007, 70, 2, 224-235, https://doi.org/10.1016/j.chemosphere.2007.06.056 . [all data]