1-[(E)-1,4,7,10,11,14,15-heptamethyl-4-vinyl-5-hexadecenyl]-3,3,4-trimethyl-1-cyclohexene, isomer # 1

Normal alkane RI, non-polar column, custom temperature program

View large format table.

Column type Active phase I Reference Comment
CapillaryDB-1 MS2770.Gao, Simoneit, et al., 200730. m/0.25 mm/0.25 μm; Program: 60 0C 6 0C/min -> 180 0C 3 0C/min -> 300 0C (20 min)

References

Gao, Simoneit, et al., 2007
Gao, M.; Simoneit, B.R.T.; Gantar, M.; Jaffe, R., Occurrence and distribution of novel botryococcene hydrocarbons in freshwater wetland of the Florida Everglades, Chemosphere, 2007, 70, 2, 224-235, https://doi.org/10.1016/j.chemosphere.2007.06.056 . [all data]