1,1,6-trimethyl-3-methylene-2-[(4E)-3,6,13,14-tetramethyl-10-methylene-6-vinyl-4,14-pentadecadienyl]cyclohexane, isomer # 2

Normal alkane RI, non-polar column, custom temperature program

Data compiled by: NIST Mass Spectrometry Data Center, William E. Wallace, director

Column type Capillary
Active phase DB-1 MS
Column length (m) 30.
Carrier gas
Substrate
Column diameter (mm) 0.25
Phase thickness (μm) 0.25
Program 60 0C 6 0C/min -> 180 0C 3 0C/min -> 300 0C (20 min)
I 2709.
ReferenceGao, Simoneit, et al., 2007
Comment MSDC-RI

References

Gao, Simoneit, et al., 2007
Gao, M.; Simoneit, B.R.T.; Gantar, M.; Jaffe, R., Occurrence and distribution of novel botryococcene hydrocarbons in freshwater wetland of the Florida Everglades, Chemosphere, 2007, 70, 2, 224-235, https://doi.org/10.1016/j.chemosphere.2007.06.056 . [all data]