(E)-Santalol acetate

Normal alkane RI, non-polar column, custom temperature program

View large format table.

Column type Active phase I Reference Comment
CapillaryDB-51869.Arriaga, Rodrigues, et al., 200730. m/0.25 mm/0.25 μm, Helium; Program: 35 0C 4 0C/min -> 180 0C 10 0C/min -> 250 0C

References

Arriaga, Rodrigues, et al., 2007
Arriaga, A.M.C.; Rodrigues, F.E.A.; Lemos, T.L.G.; de Oliveira, M. daC.F.; Lima, J.Q.; Santiago, G.M.P.; Braz-Filho, R.B.; Mafezoli, J., Composition and larvicidal activity os essential oil from Stemodia maritima L., Natural Product Communications, 2007, 2, 12, 1237-1239. [all data]