5-Methoxy-4-methoxymethyl-2-methyl-1H-indole

Normal alkane RI, non-polar column, temperature ramp

View large format table.

Column type Active phase I Reference Comment
CapillaryBPX-51800.Fons, Rapior, et al., 200625. m/0.20 mm/0.13 μm, Helium, 50. C @ 2. min, 3. K/min; Tend: 230. C

References

Fons, Rapior, et al., 2006
Fons, F.; Rapior, S.; Fruchier, A., Volatile composition of Clitocybe amoenolens, Tricholoma caligatum and Hebeloma radicosum, Cryptogamie, Mycologie, 2006, 27, 1, 45-55. [all data]