Dibenzo[d,d']benzodifuran

Lee's RI, non-polar column, temperature ramp

View large format table.

Column type Active phase I Reference Comment
CapillaryHP-5 MS402.74zu Reckendorf, 200325. m/0.25 mm/0.33 μm, 5. K/min; Tstart: 70. C; Tend: 320. C
CapillaryHP-5 MS407.65zu Reckendorf, 200325. m/0.25 mm/0.33 μm, 5. K/min; Tstart: 70. C; Tend: 320. C
CapillaryHP-5 MS411.42zu Reckendorf, 200325. m/0.25 mm/0.33 μm, 5. K/min; Tstart: 70. C; Tend: 320. C

References

zu Reckendorf, 2003
zu Reckendorf, R.M., Pattern change of several polycyclic aromatic furans and analogous thiophenes on oxidative pyrolysis of pitches in flue gases, and the relevance to their quantitative analysis, Chromatographia, 2003, 58, 1/2, 103-113. [all data]