GA24, Methylated

Normal alkane RI, non-polar column, custom temperature program

View large format table.

Column type Active phase I Reference Comment
CapillaryPolydimethyl siloxane2447.Tanno, Nakayama, et al., 1995Program: not specified
CapillaryPolydimethyl siloxane2447.Tanno, Nakayama, et al., 1995Program: not specified
CapillaryPolydimethyl siloxane2448.Tanno, Nakayama, et al., 1995Program: not specified

References

Tanno, Nakayama, et al., 1995
Tanno, N.; Nakayama, M.; Kurosawa, H.; Wakatsuki, M.; Tanno, M.; Abe, M.; Okagami, N.; Yokota, T., Endogenous gibberellins from three East Asian Stenophora species of the genus Dioscorea (Yams), Z. Naturforsch., 1995, 50c, 193-198. [all data]