(Z,Z)-9,12-Octadecadienal

Normal alkane RI, non-polar column, temperature ramp

View large format table.

Column type Active phase I Reference Comment
CapillaryOV-1011971.Sugisawa, Nakamura, et al., 1990Nitrogen, 2. K/min; Column length: 50. m; Column diameter: 0.25 mm; Tstart: 70. C; Tend: 200. C
CapillaryOV-1011970.Sugisawa, Nakamura, et al., 1990Nitrogen, 2. K/min; Column length: 50. m; Column diameter: 0.25 mm; Tstart: 80. C; Tend: 200. C

References

Sugisawa, Nakamura, et al., 1990
Sugisawa, H.; Nakamura, K.; Tamura, H., The aroma profile of the volatile in marine green algae (Ulva pertusa), Food Reviews International, 1990, 6, 4, 573-589, https://doi.org/10.1080/87559129009540893 . [all data]