Octatriacontane, 11,15,19-trimethyl

Normal alkane RI, non-polar column, temperature ramp

View large format table.

Column type Active phase I Reference Comment
PackedOV-1013875.Nelson, de Renobales, et al., 1989Helium, Gas-Chrom Q (100-120 mesh), 3. K/min, 320. C @ 25. min; Column length: 3. m; Tstart: 150. C

References

Nelson, de Renobales, et al., 1989
Nelson, D.R.; de Renobales, M.; Dwyer, L.A.; Zamboni, A.C.; Fatland, C.L.; Blomquist, G.J., Novel very long-chain methyl branched alcohols and their esters, and methyl branched alkanes in pupae of the gabbage looper, Trichoplusa ni (Hubner), Insect Biochem., 1989, 19, 2, 197-208, https://doi.org/10.1016/0020-1790(89)90092-9 . [all data]