Benzaldehyde, 2-hydroxy, oxime, bis-TMS

Van Den Dool and Kratz RI, non-polar column, temperature ramp

View large format table.

Column type Active phase I Reference Comment
PackedSE-301560.Staniewski and Szymanowski, 1990He, Gas Chrom Q, 6. K/min; Column length: 2. m; Tstart: 50. C
PackedOV-11550.Mattsson and Petersson, 1977N2, Supelcoport, 4. K/min; Column length: 2. m; Tstart: 80. C; Tend: 240. C

References

Staniewski and Szymanowski, 1990
Staniewski, J.; Szymanowski, J., Gas chromatographic analyses of hydroxyoxime extractants of metals and their intermediates. I. Alkylsalicylaldehyde oximes, J. Chromatogr., 1990, 503, 442-448, https://doi.org/10.1016/S0021-9673(01)81524-7 . [all data]

Mattsson and Petersson, 1977
Mattsson, M.; Petersson, G., Reference GLC Data for the Analysis of Phenolic Compounds as Trimethylsilyl Derivatives, J. Chromatogr. Sci., 1977, 15, 12, 546-554, https://doi.org/10.1093/chromsci/15.12.546 . [all data]