(E/Z)-3β,29-bis-(Trimethylsilyloxy)lup-20(29)-ene, # 1

Normal alkane RI, non-polar column, isothermal

Data compiled by: NIST Mass Spectrometry Data Center, William E. Wallace, director

Column type Packed
Active phase SE-30
Column length (m) 1.2
Carrier gas
Substrate Gas-Chrom Q (80-100 mesh)
Column diameter (mm)
Phase thickness (μm)
Temperature (C) 250. - 280.
I 3580.
ReferenceCorbett, Cong, et al., 1987
Comment MSDC-RI

References

Corbett, Cong, et al., 1987
Corbett, R.E.; Cong, A.N.T.; Holland, P.T.; Wilkins, A.L., Lichenms and fungi. XVIII. Extractives from Pseudocyphellaria rubella, Austr. J. Chem., 1987, 40, 3, 461-468, https://doi.org/10.1071/CH9870461 . [all data]