4(e)-Hydroxyadamantan-2-one

Normal alkane RI, non-polar column, isothermal

View large format table.

Column type Active phase Temperature (C) I Reference Comment
CapillaryOV-101200.1607.Triska and Vodicka, 1991Column length: 50. m; Column diameter: 0.25 mm
CapillaryOV-101210.1618.Triska and Vodicka, 1991Column length: 50. m; Column diameter: 0.25 mm
CapillaryOV-101220.1625.Triska and Vodicka, 1991Column length: 50. m; Column diameter: 0.25 mm
CapillaryOV-101200.1607.Vodicka, Triska, et al., 1986Nitrogen; Column length: 50. m; Column diameter: 0.25 mm
CapillaryOV-101210.1618.Vodicka, Triska, et al., 1986Nitrogen; Column length: 50. m; Column diameter: 0.25 mm

References

Triska and Vodicka, 1991
Triska, J.; Vodicka, L., Characterization of ditopic oxygen-containing adamantane derivatives by capillary gas chromatography and thin-layer chromatography, Sbornik Vysoke Skoly Chemisco-Techlogicke v Praze, 1991, D59, 91-100. [all data]

Vodicka, Triska, et al., 1986
Vodicka, L.; Triska, J.; Hlavaty, J., Characterization of oxygen-containing qdqmqntane derivatives by parillary gas chromatography, J. Chromatogr., 1986, 366, 382-384, https://doi.org/10.1016/S0021-9673(01)93487-9 . [all data]