2,4,6-tris-(Methoxycarbonyl)-1-hexene

Normal alkane RI, non-polar column, temperature ramp

View large format table.

Column type Active phase I Reference Comment
CapillaryOV-1011730.Blazso, Ujszaszi, et al., 198010. K/min; Column length: 20. m; Column diameter: 0.23 mm; Tstart: 60. C; Tend: 280. C

References

Blazso, Ujszaszi, et al., 1980
Blazso, M.; Ujszaszi, K.; Jakab, E., Isomeric structure of styrene-acrylonitrile and styrene-methylacrylate copolymer pyrolysis products, Chromatographia, 1980, 13, 3, 151-156, https://doi.org/10.1007/BF02259304 . [all data]