13,14-Dihydro-PGE2, EO-TMS, isomer # 2

Normal alkane RI, non-polar column, isothermal

Data compiled by: NIST Mass Spectrometry Data Center, William E. Wallace, director

Column type Capillary
Active phase OV-101
Column length (m) 50.
Carrier gas
Substrate
Column diameter (mm) 0.27
Phase thickness (μm)
Temperature (C) 245.
I 2795.
ReferenceFitzpatrick, 1978
Comment MSDC-RI

References

Fitzpatrick, 1978
Fitzpatrick, F.A., Separation of prostaglandines and thromboxanes by gas chromatography with glass capillary columns, Anal. Chem., 1978, 50, 1, 47-52, https://doi.org/10.1021/ac50023a017 . [all data]