Indoleacetic acid, methyl, 1-PFP

Normal alkane RI, non-polar column, isothermal

View large format table.

Column type Active phase Temperature (C) I Reference Comment
PackedSE-30200.1637.Segura and Gelpi, 1975Helium; Column length: 2. m

References

Segura and Gelpi, 1975
Segura, J.; Gelpi, E., Application of gas chromatography and mass spectrometry in neurochemical studies: determination on indole amine profiles at the picogram level, Acta vitamin. enzymol., 1975, 29, 1-6, 25-31. [all data]