N-Nitrosodibutylamine, HFBA-derivative

Normal alkane RI, non-polar column, isothermal

View large format table.

Column type Active phase Temperature (C) I Reference Comment
PackedOV-1135.1290.Gough, Sugden, et al., 1975Helium, Chromosorb G AW DMCS (100-120 mesh); Column length: 2.7 m

References

Gough, Sugden, et al., 1975
Gough, T.A.; Sugden, K.; Webb, K.S., Pyridine catalyzed reaction of volatile N-nitrosamines with heptafluorobutyric anhydride, Anal. Chem., 1975, 47, 3, 509-512, https://doi.org/10.1021/ac60353a028 . [all data]