Silane, tetrahexyloxy

Normal alkane RI, non-polar column, isothermal

View large format table.

Column type Active phase Temperature (C) I Reference Comment
PackedApieson M160.2178.Ellren, Peetre, et al., 1974Chromosorb G AW DMCS (80-100 mesh)

References

Ellren, Peetre, et al., 1974
Ellren, O.; Peetre, I.B.; Smith, B.E.F., Gas chromatographic investigation of organometallic compounds and their carbon analogues. V. Use of refractive index in conjunction with Kovats retention index for the identification of organosilicon compounds, J. Chromatogr., 1974, 93, 2, 383-392, https://doi.org/10.1016/S0021-9673(01)85402-9 . [all data]