Dimethyl 1,3-dithio-2-selenide

Normal alkane RI, non-polar column, isothermal

View large format table.

Column type Active phase Temperature (C) I Reference Comment
PackedSE-30 (10 %) + CW-20M (1 %)112.1043.Hillen and Werner, 1973Nitrogen, Chromosorb W DCMS (100-120 mesh); Column length: 2. m

References

Hillen and Werner, 1973
Hillen, L.W.; Werner, R.L., Correlation of retention index data for dimethyl polysulfides, polyselenides, and related thiaselena-alkanes, J. Chromatogr., 1973, 79, 318-321, https://doi.org/10.1016/S0021-9673(01)85303-6 . [all data]