Thiophene, 3-butylthio

Kovats' RI, non-polar column, isothermal

Data compiled by: NIST Mass Spectrometry Data Center, William E. Wallace, director

Column type CapillaryCapillaryCapillary
Active phase OV-101OV-101OV-101
Column length (m) 50.50.50.
Carrier gas HeHeHe
Substrate
Column diameter (mm) 0.320.320.32
Phase thickness (μm) 0.50.50.5
Temperature (C) 130.140.150.
I 1319.1324.1329.
ReferenceMisharina, Aerov, et al., 1990Misharina, Aerov, et al., 1990Misharina, Aerov, et al., 1990
Comment MSDC-RI MSDC-RI MSDC-RI

References

Misharina, Aerov, et al., 1990
Misharina, T.A.; Aerov, A.F.; Golovnya, R.V., Gas Chromatographic infrared and mass spectrometric data for identification of isomeric alkylthienylsulphides, Zh. Anal. Khim., 1990, 45, 535-543. [all data]