11,12-seco-12,13-didehydromultiflorine

Normal alkane RI, non-polar column, temperature ramp

View large format table.

Column type Active phase I Reference Comment
CapillaryDB-12211.Beuerle, 2010He, 6. K/min; Column length: 30. m; Column diameter: 0.32 mm; Tstart: 150. C; Tend: 300. C
CapillaryDB-12210.Planchuelo-Ravelo and Wink, 19936. K/min; Column length: 30. m; Column diameter: 0.3 mm; Tstart: 150. C; Tend: 270. C

Normal alkane RI, non-polar column, custom temperature program

View large format table.

Column type Active phase I Reference Comment
CapillaryDB-12215.El-Shazly, Ateya, et al., 2001Helium; Column length: 15. m; Column diameter: 0.317 mm; Program: 150 0C (2 min) 15 0C/min -> 250 0C 25 0C/min -> 300 0C (5 min)
CapillaryDB-12215.Wink, Meissner, et al., 1995Column length: 30. m; Column diameter: 0.3 mm; Program: not specified

References

Beuerle, 2010
Beuerle, T., MS and RI data. Personal communication., 2010. [all data]

Planchuelo-Ravelo and Wink, 1993
Planchuelo-Ravelo, A.M.; Wink, M., Alkaloid composition of Lupinus-albescens (Fabaceae) from South America, Z. Naturforsch. C:, 1993, 48, 5-6, 414-416. [all data]

El-Shazly, Ateya, et al., 2001
El-Shazly, A.; Ateya, A.-M.M.; Wink, M., Quinolizidine alkaloid profiles of lupunus varius orientalis. L. albus albus, L. hartwegii, and L. densiflorus, Z. Naturforsch., 2001, 56c, 21-30. [all data]

Wink, Meissner, et al., 1995
Wink, M.; Meissner, C.; Witte, L., Patterns of quinolizidine alkaloids in 56 species of the genus Lupinus, Phytochemistry, 1995, 38, 1, 139-153, https://doi.org/10.1016/0031-9422(95)91890-D . [all data]