Thiophene, 3-(1-methylethyl)thio

Kovats' RI, non-polar column, isothermal

View large format table.

Column type Active phase Temperature (C) I Reference Comment
CapillaryOV-101130.1168.Misharina, Aerov, et al., 199050. m/0.32 mm/0.5 μm, He
CapillaryOV-101140.1173.Misharina, Aerov, et al., 199050. m/0.32 mm/0.5 μm, He
CapillaryOV-101150.1179.Misharina, Aerov, et al., 199050. m/0.32 mm/0.5 μm, He

Van Den Dool and Kratz RI, non-polar column, temperature ramp

View large format table.

Column type Active phase I Reference Comment
CapillaryOV-1011158.Misharina, Aerov, et al., 199050. m/0.32 mm/0.5 μm, He, 4. K/min; Tstart: 50. C
CapillaryOV-1011155.Misharina, Aerov, et al., 199050. m/0.32 mm/0.5 μm, He, 2. K/min; Tstart: 80. C
CapillaryOV-1011161.Misharina, Aerov, et al., 199050. m/0.32 mm/0.5 μm, He, 4. K/min; Tstart: 80. C

References

Misharina, Aerov, et al., 1990
Misharina, T.A.; Aerov, A.F.; Golovnya, R.V., Gas Chromatographic infrared and mass spectrometric data for identification of isomeric alkylthienylsulphides, Zh. Anal. Khim., 1990, 45, 535-543. [all data]