Decahydro-3a-methyl-6-methylene-1-(1-methylethyl)cyclobuta[1,2:3,4]dicyclopentadiene

Normal alkane RI, non-polar column, custom temperature program

View large format table.

Column type Active phase I Reference Comment
CapillaryOV-11447.Li, Liang, et al., 2009Helium; Column length: 30. m; Column diameter: 0.25 mm; Program: 40 0C 2 0C/min -> 120 0C 10 0C/min -> 230 0C (15 min)

References

Li, Liang, et al., 2009
Li, X.-R.; Liang, Y.-Z.; Zhou, T.; Zhang, L.-X.; Hu, C.-D., Comparative analysis of volatile constituents between recipe jingfangsan and its single herbs by GC-MS combined with alternative moving window factor analysis method, J. Sep. Sci., 2009, 32, 2, 258-266, https://doi.org/10.1002/jssc.200800574 . [all data]