5-Methyl-2-(1-methylethenylidene)cyclohexanone

Normal alkane RI, non-polar column, custom temperature program

Data compiled by: NIST Mass Spectrometry Data Center, William E. Wallace, director

Column type CapillaryCapillary
Active phase OV-1OV-1
Column length (m) 30.30.
Carrier gas HeliumHelium
Substrate
Column diameter (mm) 0.250.25
Phase thickness (μm)
Program 40 0C 2 0C/min -> 120 0C 10 0C/min -> 230 0C (15 min)40 0C 2 0C/min -> 120 0C 10 0C/min -> 230 0C (15 min)
I 1332.1335.
ReferenceLi, Liang, et al., 2009Li, Liang, et al., 2009
Comment MSDC-RI MSDC-RI

References

Li, Liang, et al., 2009
Li, X.-R.; Liang, Y.-Z.; Zhou, T.; Zhang, L.-X.; Hu, C.-D., Comparative analysis of volatile constituents between recipe jingfangsan and its single herbs by GC-MS combined with alternative moving window factor analysis method, J. Sep. Sci., 2009, 32, 2, 258-266, https://doi.org/10.1002/jssc.200800574 . [all data]