Benzoic acid, 2(methylamino)methyl

Normal alkane RI, non-polar column, temperature ramp

Data compiled by: NIST Mass Spectrometry Data Center, William E. Wallace, director

Column type Capillary
Active phase OV-1
Column length (m) 30.
Carrier gas Helium
Substrate
Column diameter (mm) 0.25
Phase thickness (μm) 0.25
Tstart (C) 65.
Tend (C) 260.
Heat rate (K/min) 6.
Initial hold (min)
Final hold (min)
I 1484.
ReferenceWang, Yi, et al., 2008
Comment MSDC-RI

References

Wang, Yi, et al., 2008
Wang, Y.; Yi, L.; Liang, Y.; Li, H.; Yuan, D.; Gao, H.; Zeng, M., Comparative analysis of essential oil components in Pericarpium Citri Reticulatae Viride and Pericarpium Citri Reticulatae by GC-MS combined with chemometric resolution method, J. Pharmaceutical and Biomedical Anal., 2008, 46, 1, 66-74, https://doi.org/10.1016/j.jpba.2007.08.030 . [all data]