Acetone, methylthio, PFBO # 2

Normal alkane RI, non-polar column, custom temperature program

Data compiled by: NIST Mass Spectrometry Data Center, William E. Wallace, director

Column type Capillary
Active phase ZB-5
Column length (m) 30.
Carrier gas Helium
Substrate
Column diameter (mm) 0.25
Phase thickness (μm) 0.50
Program 50 0C (3 min) 20 0C/min -> 125 0C (0.5 min) 5 0C/min -> 255 0C (0.5 min) 20 0C/min -> 300 0C (5 min)
I 1498.
ReferenceSchmarr, Potouridis, et al., 2008
Comment MSDC-RI

References

Schmarr, Potouridis, et al., 2008
Schmarr, H.-G.; Potouridis, T.; Gans, S.; Sang, W.; Kopp, B.; Bokuz, U.; Fischer, U., Analysis of carbonyl compounds via headspace solid-phase microectraction with on-fiber derivatization and gas chromatographic-ion trap tandem mass spectrometric determination of their O-(2,3,4,5,6-pentafluorobenzyl)oxime derivatives, Anal. Chim. Acta, 2008, 617, 1-2, 119-131, https://doi.org/10.1016/j.aca.2008.02.002 . [all data]