Benzaldehyde, PFBO # 1

Normal alkane RI, non-polar column, custom temperature program

View large format table.

Column type Active phase I Reference Comment
CapillaryZB-52282.Schmarr, Potouridis, et al., 200830. m/0.25 mm/0.50 μm, Helium; Program: 50 0C (3 min) 20 0C/min -> 125 0C (0.5 min) 5 0C/min -> 255 0C (0.5 min) 20 0C/min -> 300 0C (5 min)

Normal alkane RI, polar column, temperature ramp

View large format table.

Column type Active phase I Reference Comment
CapillaryZB-Wax1667.Schmarr, Potouridis, et al., 200830. m/0.25 mm/0.50 μm, Helium, 35. C @ 5. min, 4. K/min, 250. C @ 10. min

References

Schmarr, Potouridis, et al., 2008
Schmarr, H.-G.; Potouridis, T.; Gans, S.; Sang, W.; Kopp, B.; Bokuz, U.; Fischer, U., Analysis of carbonyl compounds via headspace solid-phase microectraction with on-fiber derivatization and gas chromatographic-ion trap tandem mass spectrometric determination of their O-(2,3,4,5,6-pentafluorobenzyl)oxime derivatives, Anal. Chim. Acta, 2008, 617, 1-2, 119-131, https://doi.org/10.1016/j.aca.2008.02.002 . [all data]