Calamusenone

Normal alkane RI, non-polar column, custom temperature program

Data compiled by: NIST Mass Spectrometry Data Center, William E. Wallace, director

Column type CapillaryCapillary
Active phase DB-5DB-5
Column length (m) 30.30.
Carrier gas HeliumHelium
Substrate
Column diameter (mm) 0.250.25
Phase thickness (μm)
Program 80 0C (2 min) 3 0C/min -> 180 0C 10 0C/min -> 300 0C (10 min)not specified
I 1677.1680.
ReferenceSantos, Costa, et al., 2008Santos, Costa, et al., 2008
Comment MSDC-RI MSDC-RI

References

Santos, Costa, et al., 2008
Santos, P.O.; Costa, M. deJ.C.; Alves, J.A.B.; Nascimento, P.F.C.; de Melo, D.L.F.M.; Barbosa, A.M., Jr.; Trindade, R. de.C.; Blank, A.F.; Arrigoni-Blank, M.F.; Alves, P.B.; do Nascimento, M. da.P.F., Chemical composition and antimicrobial activity of the essential oil of Hyptis pectinata (L.) Poit., Quim. Nova., 2008, 31, 7, 1648-1652, https://doi.org/10.1590/S0100-40422008000700009 . [all data]