4(14),11-Eudesmadiene

Normal alkane RI, non-polar column, custom temperature program

View large format table.

Column type Active phase I Reference Comment
CapillaryHP-5MS1465.Ning, Zheng, et al., 200830. m/0.25 mm/0.25 μm, He; Program: 40 0C (2 min) 3 0C/min -> 180 0C (2 min) 15 0C -> 280 0C

References

Ning, Zheng, et al., 2008
Ning, H.; Zheng, F.; Sun, B.; Xie, J.; Liu, Y., Solvent-free microwave extraction of essential oil from Zanthoxylum bungeanum Maxim., Food Environ. Ind. (Chinese), 2008, 34, 5, 179-184. [all data]