3,7,11,15-Tetramethylhexadecene, isomer 2

Normal alkane RI, non-polar column, temperature ramp

View large format table.

Column type Active phase I Reference Comment
CapillaryHP-51863.Isidorov, Lech, et al., 200830. m/0.25 mm/0.25 μm, Helium, 3. K/min, 300. C @ 30. min; Tstart: 50. C

Normal alkane RI, non-polar column, custom temperature program

View large format table.

Column type Active phase I Reference Comment
CapillaryDB-5 MS1899.Watanabe, Ueda, et al., 200830. m/0.32 mm/1.0 μm, Helium; Program: -10 0C (3 min) 50 0C/min -> 40 0C 5 0C/min -> 290 0C (5 min)

References

Isidorov, Lech, et al., 2008
Isidorov, V.A.; Lech, P.; Zolciak, A.; Rusak, N.; Szczepaniak, L., Gas Chromatographic - nass spectrometric investigation of metabolites from the needles and roots of pine seedlings at early stages of pathogenic fungi Armillaria ostoyae attack, Trees, 2008, 22, 4, 531-542, https://doi.org/10.1007/s00468-008-0213-z . [all data]

Watanabe, Ueda, et al., 2008
Watanabe, A.; Ueda, Y.; Higuchi, M.; Shiba, N., Analysis of volatile compounds in beef fat by dinamic-headspace solid phase microextraction combined with gas chromatography - mass spectrometry, J. Food Sci., 2008, 73, 5, 420-425, https://doi.org/10.1111/j.1750-3841.2008.00764.x . [all data]