2-[2-Hydroxy-3-(N-methyl-2-pyrrolidinyl)propanyl]-N-methylpyrrolidine (isomer 2)

Normal alkane RI, non-polar column, custom temperature program

View large format table.

Column type Active phase I Reference Comment
CapillaryOV-11695.Ei-Shazly and Wink M., 200815. m/0.317 mm/0.25 μm, He; Program: 100 0C (2 min) 15 0C/min -> 250 0C 25 0C/min -> 300 0C (5 min)

References

Ei-Shazly and Wink M., 2008
Ei-Shazly, A.; Wink M., Tropane and pyrrolidine alkaloids from Convolvulus lanatus Vahl, Z. Naturforsch. C:, 2008, 63, 5-6, 321-325. [all data]