7-O-Senecioylplatinecine

Normal alkane RI, non-polar column, temperature ramp

View large format table.

Column type Active phase I Reference Comment
CapillaryOV-11848.Asres, Sporer, et al., 200830. m/0.25 mm/0.25 μm, Helium, 6. K/min; Tstart: 100. C; Tend: 300. C

References

Asres, Sporer, et al., 2008
Asres, K.; Sporer, F.; Wink, M., Occurence of pyrrolizidine alkaloids in three Ethiopian Solanecio species, Biochem. Systematics and Ecology, 2008, 36, 5-6, 399-407, https://doi.org/10.1016/j.bse.2007.10.003 . [all data]