Quercetin, 3,7,3',4'-tetra-TMS

Normal alkane RI, non-polar column, temperature ramp

View large format table.

Column type Active phase I Reference Comment
CapillaryHP-53092.Zenkevich, Eshchenko, et al., 200730. m/0.25 mm/0.25 μm, Helium, 30. C @ 5. min, 7. K/min, 300. C @ 20. min

References

Zenkevich, Eshchenko, et al., 2007
Zenkevich, I.G.; Eshchenko, A.Yu.; Makarova, S.V.; Vitenberg, A.G.; Dobryakov, Yu.G.; Utsal, V.A., Identification of the products of oxidation of quercetin by air oxygen at ambient temperature, Molecules, 2007, 12, 3, 654-672, https://doi.org/10.3390/12030654 . [all data]