(Z)-2-(Z)-13-Octadecadien-1-ol acetate

Normal alkane RI, non-polar column, temperature ramp

View large format table.

Column type Active phase I Reference Comment
CapillaryEC-52082.Reboucas, Sant-Ana, et al., 200730. m/0.25 mm/0.25 μm, He, 100. C @ 1. min, 10. K/min; Tend: 250. C

Normal alkane RI, polar column, temperature ramp

View large format table.

Column type Active phase I Reference Comment
CapillaryAT-Wax2070.Reboucas, Sant-Ana, et al., 200730. m/0.25 mm/0.25 μm, He, 100. C @ 1. min, 10. K/min; Tend: 250. C

References

Reboucas, Sant-Ana, et al., 2007
Reboucas, L.M.; Sant-Ana, A.E.G.; Griepink, F.C., Kovats retention indexes of mono- and di-unsaturated C18 alcohols, acetates and aldehydes found in Lepidopteran pheromone blends in XVI International Plant Protection Congress. Congress Proceedings. Vol.2, Scottish Exhibition and Conference Centre, Glagow, Scotland, UK, 15-18 October, 2007, 2007, 590-591. [all data]