3α-Methylitaconyloxytropane

Van Den Dool and Kratz RI, non-polar column, temperature ramp

Data compiled by: NIST Mass Spectrometry Data Center, William E. Wallace, director

Column type Capillary
Active phase HP-5MS
Column length (m) 30.
Carrier gas
Substrate
Column diameter (mm) 0.25
Phase thickness (μm) 0.25
Tstart (C) 70.
Tend (C) 285.
Heat rate (K/min) 5.
Initial hold (min) 1.
Final hold (min) 15.
I 1891.
ReferenceHumam, Munoz, et al., 2007
Comment MSDC-RI

References

Humam, Munoz, et al., 2007
Humam, M.; Munoz, O.; Christen, P.; Hostettmann, K., Tropane alkaloids of the aerial part of Schizanthus tricolor, Nat. Prod. Commun., 2007, 2, 7, 743-747. [all data]